CsOEt

Condensed phase thermochemistry data

Data compiled by: José A. Martinho Simões

Quantity Value Units Method Reference Comment
Δfsolid-405.8 ± 4.2kJ/molRSCBousquet, Blanchard, et al., 1975Value corrected based on a set of ancillary data by J.A. Martinho Simões; Please also see Tel'noi and Rabinovich, 1980. Value quoted from Tel'noi and Rabinovich, 1980

References

Bousquet, Blanchard, et al., 1975
Bousquet, J.; Blanchard, J.M.; Joly, R.D.; Lettoffe, J.M.; Perachon, G.; Thourey, J., Bull. Soc. Chim. France, 1975, 3, 478. [all data]

Tel'noi and Rabinovich, 1980
Tel'noi, V.I.; Rabinovich, I.B., Russ. Chem. Rev., 1980, 49, 603. [all data]