Li(s-Bu)

Reaction thermochemistry data

Data compiled by: José A. Martinho Simões

Individual Reactions

C4H9Li (l) + Hydrogen bromide (g) = Butane (l) + Lithium bromide (cr)

By formula: C4H9Li (l) + HBr (g) = C4H10 (l) + BrLi (cr)

Quantity Value Units Method Reference Comment
Δr-374.0 ± 2.0kJ/molRSCHolm, 1974Please also see Pedley and Rylance, 1977. The reaction enthalpy was quoted from Pedley and Rylance, 1977. See Liebman, Martinho Simões, et al., 1995 for comments

References

Holm, 1974
Holm, T., J. Organometal. Chem., 1974, 77, 27. [all data]

Pedley and Rylance, 1977
Pedley, J.B.; Rylance, J., Computer Analysed Thermochemical Data: Organic and Organometallic Compounds, University of Sussex, Brigton, 1977. [all data]

Liebman, Martinho Simões, et al., 1995
Liebman, J.F.; Martinho Simões, J.A.; Slayden, S.W., In Lithium Chemistry: A Theoretical and Experimental Overview Wiley: New York, Sapse, A.-M.; Schleyer, P. von Ragué, ed(s)., 1995. [all data]