MeSOMe..1,4-naphthoquinone radical anion

Reaction thermochemistry data

Data compiled by: John E. Bartmess

Individual Reactions

1,4-Naphthalenedione anion + Dimethyl Sulfoxide = C12H12O3S-

By formula: C10H6O2- + C2H6OS = C12H12O3S-

Quantity Value Units Method Reference Comment
Δr24. ± 6.7kJ/molIMREChowdhury, Grimsrud, et al., 1987gas phase; Free energy affinity at 70°C.

Ion clustering data

Data compiled by: John E. Bartmess

Clustering reactions

1,4-Naphthalenedione anion + Dimethyl Sulfoxide = C12H12O3S-

By formula: C10H6O2- + C2H6OS = C12H12O3S-

Quantity Value Units Method Reference Comment
Δr24. ± 6.7kJ/molIMREChowdhury, Grimsrud, et al., 1987gas phase; Free energy affinity at 70°C.

References

Chowdhury, Grimsrud, et al., 1987
Chowdhury, S.; Grimsrud, E.P.; Kebarle, P., Bonding of Charged Delocalized Anions to Protic and Dipolar Aprotic Solvent Molecules, J. Phys. Chem., 1987, 91, 10, 2551, https://doi.org/10.1021/j100294a021 . [all data]