U2F8 anion

Gas phase ion energetics data

Data compiled by: John E. Bartmess

Electron affinity of neutral species

EAneutral (eV) Method Reference Comment
2.2983R-APyatenko and Gorokhov, 1984value altered from reference due to conversion from electron convention to ion convention

References

Pyatenko and Gorokhov, 1984
Pyatenko, A.T.; Gorokhov, L.N., Electron Affinities of the U2Fn Molecules (8n12), Chem. Phys. Lett., 1984, 105, 2, (1984)}, https://doi.org/10.1016/0009-2614(84)85651-1 . [all data]