nitrobenzene..cC6F11-CF3 radical anion

Reaction thermochemistry data

Data compiled by: John E. Bartmess

Individual Reactions

Perfluoro(methylcyclohexane) anion + Benzene, nitro- = C13H5F14NO2-

By formula: C7F14- + C6H5NO2 = C13H5F14NO2-

Quantity Value Units Method Reference Comment
Δr28. ± 4.2kJ/molIMREChowdhury and Kebarle, 1986gas phase

Ion clustering data

Data compiled by: John E. Bartmess

Clustering reactions

Perfluoro(methylcyclohexane) anion + Benzene, nitro- = C13H5F14NO2-

By formula: C7F14- + C6H5NO2 = C13H5F14NO2-

Quantity Value Units Method Reference Comment
Δr28. ± 4.2kJ/molIMREChowdhury and Kebarle, 1986gas phase

References

Chowdhury and Kebarle, 1986
Chowdhury, S.; Kebarle, P., Role of Binding Energies in A-.B and A.B- Complexes in the Kinetics of Gas Phase Electron Transfer Reactions:A- + B = A + B- Involving Perfluoro Compounds: SF6, C6F11CF3, J. Chem. Phys., 1986, 85, 9, 4989, https://doi.org/10.1063/1.451687 . [all data]