ReO4 anion

Gas phase thermochemistry data

Data compiled by: John E. Bartmess

Quantity Value Units Method Reference Comment
Δfgas-232.9 ± 5.1kcal/molR-EAChen, Zhai, et al., 2011
Δfgas-231.8 ± 7.2kcal/molTDEqSidorov, Rudnyi, et al., 1983value altered from reference due to conversion from electron convention to ion convention
Δfgas-207. ± 14.kcal/molAcidGould and Miller, 1975

References

Chen, Zhai, et al., 2011
Chen, W.J.; Zhai, H.J.; Huang, X.; Wang, L.S., On the electronic structure of mono-rhenium oxide clusters: ReOn- and ReOn (n=3, 4), Chem. Phys. Lett., 2011, 512, 1-3, 49-53, https://doi.org/10.1016/j.cplett.2011.07.018 . [all data]

Sidorov, Rudnyi, et al., 1983
Sidorov, L.N.; Rudnyi, E.B.; Nikitin, M.I.; Sorokin, I.D., Gas Phase Anion Exchange Reactions and the Determination of the Heats of Formation of Metaphosphate (PO3-), metaborate (BO2-), and perrhennate (ReO4-), Dokl. Akad. Nauk SSSR Ser. Khim., 1983, 272, 1172. [all data]

Gould and Miller, 1975
Gould, B.K.; Miller, W.J., Electron attachment and compound formation in flames. VI. Negative ion and compound formation in flames containing rhenium and potassium, J. Chem. Phys., 1975, 62, 644. [all data]