CD3SS anion

Gas phase ion energetics data

Data compiled by: John E. Bartmess

Electron affinity of neutral species

EAneutral (eV) Method Reference Comment
1.748 ± 0.022LPESMoran and Ellison, 1988

References

Moran and Ellison, 1988
Moran, S.; Ellison, G.B., Photoelectron Spectroscopy of Sulfur Ions, J. Phys. Chem., 1988, 92, 7, 1794, https://doi.org/10.1021/j100318a021 . [all data]