MgI anion

Gas phase thermochemistry data

Data compiled by: John E. Bartmess

Quantity Value Units Method Reference Comment
Δfgas-29.2 ± 4.9kcal/molR-EAMiller and Lineberger, 1988

References

Miller and Lineberger, 1988
Miller, T.M.; Lineberger, W.C., Electron Affinity of Magnesium Chloride, Chem. Phys. Lett., 1988, 146, 5, 364, https://doi.org/10.1016/0009-2614(88)87460-8 . [all data]