Cu3 anion

Gas phase thermochemistry data

Data compiled by: John E. Bartmess

Quantity Value Units Method Reference Comment
Δfgas504. ± 26.kJ/molTherSpasov, Lee, et al., 20000 K dissociation energy
Δfgas488. ± 37.kJ/molR-EAHo, Ervin, et al., 1990Vertical Detachment Energy: 2.37±0.01 eV.

References

Spasov, Lee, et al., 2000
Spasov, V.A.; Lee, T.H.; Ervin, K.M., Threshold collision-induced dissociation of anionic copper clusters and copper cluster monocarbonyls, J. Chem. Phys., 2000, 112, 4, 1713-1720, https://doi.org/10.1063/1.480736 . [all data]

Ho, Ervin, et al., 1990
Ho, J.; Ervin, K.M.; Lineberger, W.C., Photoelectron Spectroscopy of Metal Cluster Anions - Cun-, Agn-, and Aun-, J. Chem. Phys., 1990, 93, 10, 6987, https://doi.org/10.1063/1.459475 . [all data]