MeCOCH2CH2 anion

Reaction thermochemistry data

Data compiled by: John E. Bartmess

Individual Reactions

C4H7O- + Hydrogen cation = 2-Butanone

By formula: C4H7O- + H+ = C4H8O

Quantity Value Units Method Reference Comment
Δr401.0 ± 4.0kcal/molCIDTGraul and Squires, 1990gas phase
Δr<409.00kcal/molCIDTGraul and Squires, 1988gas phase
Quantity Value Units Method Reference Comment
Δr393.5 ± 4.1kcal/molH-TSGraul and Squires, 1990gas phase

References

Graul and Squires, 1990
Graul, S.T.; Squires, R.R., Gas-Phase Acidities Derived from Threshold Energies for Activated Reactions, J. Am. Chem. Soc., 1990, 112, 7, 2517, https://doi.org/10.1021/ja00163a007 . [all data]

Graul and Squires, 1988
Graul, S.T.; Squires, R.R., On the Existence of Alkyl Carbanions in the Gas Phase, J. Am. Chem. Soc., 1988, 110, 2, 607, https://doi.org/10.1021/ja00210a054 . [all data]