CF3CH2CH2 anion

Gas phase ion energetics data

Data compiled by: John E. Bartmess

Electron affinity of neutral species

EAneutral (eV) Method Reference Comment
0.35 ± 0.17D-EAGraul and Squires, 1990

Protonation reactions

C3H4F3- + Hydrogen cation = Propane, 1,1,1-trifluoro-

By formula: C3H4F3- + H+ = C3H5F3

Quantity Value Units Method Reference Comment
Δr406.0 ± 3.5kcal/molCIDTGraul and Squires, 1990gas phase
Δr<403.00kcal/molCIDTGraul and Squires, 1988gas phase
Quantity Value Units Method Reference Comment
Δr398.5 ± 3.6kcal/molH-TSGraul and Squires, 1990gas phase

References

Graul and Squires, 1990
Graul, S.T.; Squires, R.R., Gas-Phase Acidities Derived from Threshold Energies for Activated Reactions, J. Am. Chem. Soc., 1990, 112, 7, 2517, https://doi.org/10.1021/ja00163a007 . [all data]

Graul and Squires, 1988
Graul, S.T.; Squires, R.R., On the Existence of Alkyl Carbanions in the Gas Phase, J. Am. Chem. Soc., 1988, 110, 2, 607, https://doi.org/10.1021/ja00210a054 . [all data]