C6F6..I anion

Gas phase thermochemistry data

Data compiled by: John E. Bartmess

Quantity Value Units Method Reference Comment
Δfgas-1180. ± 9.2kJ/molTherHiraoka, Mizuse, et al., 1987

References

Hiraoka, Mizuse, et al., 1987
Hiraoka, K.; Mizuse, S.; Yamabe, S., High Symmetric Structure of the Gas Phase Ion Cluster X-..C6F6 (X = Cl, Br, I), J. Phys. Chem., 1987, 91, 20, 5294, https://doi.org/10.1021/j100304a032 . [all data]