C6F6..F anion

Gas phase thermochemistry data

Data compiled by: John E. Bartmess

Quantity Value Units Method Reference Comment
Δfgas-1310. ± 9.2kJ/molTherHiraoka, Mizuse, et al., 1987

References

Hiraoka, Mizuse, et al., 1987
Hiraoka, K.; Mizuse, S.; Yamabe, S., A Determination of the Stability and Structure of F-(C6H6) and F-(C6F6) Clusters, J. Chem. Phys., 1987, 86, 7, 4102, https://doi.org/10.1063/1.451920 . [all data]