(CO2)3 radical anion

Gas phase ion energetics data

Data compiled by: John E. Bartmess

Electron affinity of neutral species

EAneutral (eV) Method Reference Comment
2.940 ± 0.020LPESDeLuca, Niu, et al., 1988EA given is Vertical Detachment Energy. Adiabatic EA est as up to 1 eV smaller

References

DeLuca, Niu, et al., 1988
DeLuca, M.J.; Niu, B.; Johnson, M.A., Photoelectron Spectroscopy of (CO2)n- Clusters with 2=n=13: Cluster Size Dependence of the Core Molecular Ion, J. Chem. Phys., 1988, 88, 9, 5857, https://doi.org/10.1063/1.454548 . [all data]