2-furanyl-CH2 anion

Gas phase ion energetics data

Data compiled by: John E. Bartmess

Protonation reactions

C5H5O- + Hydrogen cation = Furan, 2-methyl-

By formula: C5H5O- + H+ = C5H6O

Quantity Value Units Method Reference Comment
Δr1606. ± 13.kJ/molG+TSDePuy, Kass, et al., 1988gas phase; Anion of 2-methylfuran. Order: H2O<furan<2-Me-furan<MeOH.
Quantity Value Units Method Reference Comment
Δr1577. ± 13.kJ/molIMRBDePuy, Kass, et al., 1988gas phase; Anion of 2-methylfuran. Order: H2O<furan<2-Me-furan<MeOH.

Reaction thermochemistry data

Data compiled by: John E. Bartmess

Individual Reactions

C5H5O- + Hydrogen cation = Furan, 2-methyl-

By formula: C5H5O- + H+ = C5H6O

Quantity Value Units Method Reference Comment
Δr383.8 ± 3.1kcal/molG+TSDePuy, Kass, et al., 1988gas phase; Anion of 2-methylfuran. Order: H2O<furan<2-Me-furan<MeOH.
Quantity Value Units Method Reference Comment
Δr377.0 ± 3.0kcal/molIMRBDePuy, Kass, et al., 1988gas phase; Anion of 2-methylfuran. Order: H2O<furan<2-Me-furan<MeOH.

References

DePuy, Kass, et al., 1988
DePuy, C.H.; Kass, S.R.; Bean, G.P., Formation and Reactions of Heteroaromatic Anions in the Gas Phase, J. Org. Chem., 1988, 53, 19, 4427, https://doi.org/10.1021/jo00254a001 . [all data]