N-pyrrolyl-CH2 anion

Gas phase ion energetics data

Data compiled by: John E. Bartmess

Protonation reactions

C5H6N- + Hydrogen cation = 1H-Pyrrole, 1-methyl-

By formula: C5H6N- + H+ = C5H7N

Quantity Value Units Method Reference Comment
Δr392.8 ± 3.1kcal/molG+TSDePuy, Kass, et al., 1988gas phase; Anion of N-methyl-pyrrole. Between Me2NH, H2O.
Quantity Value Units Method Reference Comment
Δr386.0 ± 3.0kcal/molIMRBDePuy, Kass, et al., 1988gas phase; Anion of N-methyl-pyrrole. Between Me2NH, H2O.

References

DePuy, Kass, et al., 1988
DePuy, C.H.; Kass, S.R.; Bean, G.P., Formation and Reactions of Heteroaromatic Anions in the Gas Phase, J. Org. Chem., 1988, 53, 19, 4427, https://doi.org/10.1021/jo00254a001 . [all data]