thiophenide anion

Reaction thermochemistry data

Data compiled by: John E. Bartmess

Individual Reactions

C4H3S- + Hydrogen cation = Thiophene

By formula: C4H3S- + H+ = C4H4S

Quantity Value Units Method Reference Comment
Δr381.2 ± 3.1kcal/molG+TSDePuy, Kass, et al., 1988gas phase; Between MeOH, EtOH. D exchange implies anion at C-2.
Quantity Value Units Method Reference Comment
Δr373.0 ± 3.0kcal/molIMRBDePuy, Kass, et al., 1988gas phase; Between MeOH, EtOH. D exchange implies anion at C-2.

References

DePuy, Kass, et al., 1988
DePuy, C.H.; Kass, S.R.; Bean, G.P., Formation and Reactions of Heteroaromatic Anions in the Gas Phase, J. Org. Chem., 1988, 53, 19, 4427, https://doi.org/10.1021/jo00254a001 . [all data]