furanide anion

Reaction thermochemistry data

Data compiled by: John E. Bartmess

Individual Reactions

C4H3O- + Hydrogen cation = Furan

By formula: C4H3O- + H+ = C4H4O

Quantity Value Units Method Reference Comment
Δr391.07 ± 0.36kcal/molG+TSGrabowski and Owusugas phase
Δr388.2 ± 3.1kcal/molG+TSDePuy, Kass, et al., 1988gas phase; Order:H2O < furan < 2-Me-furan < MeOH. D exchange indicates anion at C-2.
Quantity Value Units Method Reference Comment
Δr382.90 ± 0.20kcal/molIMREGrabowski and Owusugas phase
Δr380.0 ± 3.0kcal/molIMRBDePuy, Kass, et al., 1988gas phase; Order:H2O < furan < 2-Me-furan < MeOH. D exchange indicates anion at C-2.

References

Grabowski and Owusu
Grabowski, J.J.; Owusu, D., , as cited in 98CLI/WEN. [all data]

DePuy, Kass, et al., 1988
DePuy, C.H.; Kass, S.R.; Bean, G.P., Formation and Reactions of Heteroaromatic Anions in the Gas Phase, J. Org. Chem., 1988, 53, 19, 4427, https://doi.org/10.1021/jo00254a001 . [all data]