As2 anion

Gas phase thermochemistry data

Data compiled by: John E. Bartmess

Quantity Value Units Method Reference Comment
Δfgas28.36 ± 0.72kcal/molR-EALippa, Xu, et al., 1998
Δfgas43.1 ± 4.5kcal/molEIAEBennett, Margrave, et al., 1973From As4

References

Lippa, Xu, et al., 1998
Lippa, T.P.; Xu, S.J.; Lyapustina, S.A.; Nilles, J.M.; Bowen, K.H., Photoelectron spectroscopy of As-, As-2(-), As-3(-), As-4(-), and As-5(-), J. Chem. Phys., 1998, 109, 24, 10727-10731, https://doi.org/10.1063/1.477771 . [all data]

Bennett, Margrave, et al., 1973
Bennett, S.L.; Margrave, J.L.; Franklin, J.L.; Hudson, J.E., High temperature negative ions: Electron impact of As4 vapor, J. Chem. Phys., 1973, 59, 5814. [all data]