pCN-nitrobenzene..NO2 anion

Gas phase thermochemistry data

Data compiled by: John E. Bartmess

Quantity Value Units Method Reference Comment
Δfgas-12.1 ± 2.2kcal/molTherGrimsrud, Chowdhury, et al., 1986

References

Grimsrud, Chowdhury, et al., 1986
Grimsrud, E.P.; Chowdhury, S.; Kebarle, P., Gas Phase Reactions of NO2- with Nitrobenzenes and Quinones. Electron Transfer, Clusters, and Formation of Phenoxide and Quinoxide Negative Ions. Use of NO2 as a NICI Reagent Gas., Int. J. Mass Spectrom. Ion Proc., 1986, 68, 1-2, 57, https://doi.org/10.1016/0168-1176(86)87068-9 . [all data]