germanium dichloride anion

Gas phase thermochemistry data

Data compiled by: John E. Bartmess

Quantity Value Units Method Reference Comment
Δfgas-417.9kJ/molR-EAPabst, Margrave, et al., 1977From GeCl4. G2MP2 calculations indicate an EA of ca. 1.3 eV

References

Pabst, Margrave, et al., 1977
Pabst, R.E.; Margrave, J.L.; Franklin, J.L., Electron impact studies of the tetrachlorides and tetrabromides of silicon and germanium, Int. J. Mass Spectrom. Ion Phys., 1977, 25, 361. [all data]