HCðSi anion

Reaction thermochemistry data

Data compiled by: John E. Bartmess

Individual Reactions

CHSi- + Hydrogen cation = CH2Si

By formula: CHSi- + H+ = CH2Si

Quantity Value Units Method Reference Comment
Δr360.2 ± 3.1kcal/molG+TSDamrauer, DePuy, et al., 1988gas phase
Quantity Value Units Method Reference Comment
Δr352.5 ± 3.0kcal/molIMRBDamrauer, DePuy, et al., 1988gas phase

References

Damrauer, DePuy, et al., 1988
Damrauer, R.; DePuy, C.H.; Barlow, S.E.; Gronert, S., The Gas Phase Chemistry of the Silaacetylide Anion, HCSi-, J. Am. Chem. Soc., 1988, 110, 6, 2005, https://doi.org/10.1021/ja00214a077 . [all data]