Si2 anion

Gas phase thermochemistry data

Data compiled by: John E. Bartmess

Quantity Value Units Method Reference Comment
Δfgas58.2 ± 1.0kcal/molR-EANimlos, Harding, et al., 1987

References

Nimlos, Harding, et al., 1987
Nimlos, M.R.; Harding, L.B.; Ellison, G.B., The Electronic States of Si2 and Si2- as Revealed by Photoelectron Spectroscopy, J. Chem. Phys., 1987, 87, 9, 5116, https://doi.org/10.1063/1.453679 . [all data]