SO2..S radical anion

Gas phase thermochemistry data

Data compiled by: John E. Bartmess

Quantity Value Units Method Reference Comment
Δfgas<-78.10kcal/molIMRBGoodings, Bohme, et al., 1986S- + SO2 ->, fast in FA. G3MP2B3 calculations indicate a HOF(A-) ca. -92

References

Goodings, Bohme, et al., 1986
Goodings, J.M.; Bohme, D.K.; Elguindi, K.; Fox, A., Sulphur Anion Chemistry in Hydrocarbon Flames with H2S, OCS, and SO2 Additives, Can. J. Chem., 1986, 64, 4, 689, https://doi.org/10.1139/v86-110 . [all data]