CH2=Si(Me)O anion

Reaction thermochemistry data

Data compiled by: John E. Bartmess

Individual Reactions

C2H5OSi- + Hydrogen cation = dimethyloxosilane

By formula: C2H5OSi- + H+ = C2H6OSi

Quantity Value Units Method Reference Comment
Δr363.6 ± 4.1kcal/molG+TSDamrauer and Krempp, 1990gas phase; between CF3CH2OH and CH3CHO in acidity
Δr363.7 ± 4.1kcal/molG+TSFroelicher, Freiser, et al., 1984gas phase; Between aniline, CF3CH2OH in acidity
Quantity Value Units Method Reference Comment
Δr356.5 ± 4.0kcal/molIMRBDamrauer and Krempp, 1990gas phase; between CF3CH2OH and CH3CHO in acidity
Δr356.6 ± 4.0kcal/molIMRBFroelicher, Freiser, et al., 1984gas phase; Between aniline, CF3CH2OH in acidity

Gas phase ion energetics data

Data compiled by: John E. Bartmess

Protonation reactions

C2H5OSi- + Hydrogen cation = dimethyloxosilane

By formula: C2H5OSi- + H+ = C2H6OSi

Quantity Value Units Method Reference Comment
Δr363.6 ± 4.1kcal/molG+TSDamrauer and Krempp, 1990gas phase; between CF3CH2OH and CH3CHO in acidity
Δr363.7 ± 4.1kcal/molG+TSFroelicher, Freiser, et al., 1984gas phase; Between aniline, CF3CH2OH in acidity
Quantity Value Units Method Reference Comment
Δr356.5 ± 4.0kcal/molIMRBDamrauer and Krempp, 1990gas phase; between CF3CH2OH and CH3CHO in acidity
Δr356.6 ± 4.0kcal/molIMRBFroelicher, Freiser, et al., 1984gas phase; Between aniline, CF3CH2OH in acidity

References

Damrauer and Krempp, 1990
Damrauer, R.; Krempp, M., Gas Phase Ion-Molecule Chemistry of Methoxy-Substituted Silanes: Collision Induced Decomposition of Siloxide Ions Leading to Anions of Silaacetaldehyde and Methyl Silaformate, Organomet., 1990, 9, 4, 999, https://doi.org/10.1021/om00118a015 . [all data]

Froelicher, Freiser, et al., 1984
Froelicher, S.W.; Freiser, B.S.; Squires, R.R., Dimethylsilanone Enolate, J. Am. Chem. Soc., 1984, 106, 22, 6863, https://doi.org/10.1021/ja00334a077 . [all data]