1,3,5-Trichlorobenzene anion

Gas phase thermochemistry data

Data compiled by: John E. Bartmess

Quantity Value Units Method Reference Comment
Δfgas-46.15kJ/molR-EAChen and Wentworth, 1981G3MP2B3 calculations indicate an EA of ca. -0.03 eV, and HOF(A-) = -3 kcal/mol

References

Chen and Wentworth, 1981
Chen, E.C.M.; Wentworth, W.E., Correlation and Prediction of Electron Capture Response from Molecular Parameters, J. Chromatogr., 1981, 217, 151, https://doi.org/10.1016/S0021-9673(00)88069-3 . [all data]