CrF2..F anion

Gas phase ion energetics data

Data compiled by: John E. Bartmess

Electron affinity of neutral species

EAneutral (eV) Method Reference Comment
2.80 ± 0.19R-ABoltalina, Borshchevskii, et al., 1991Data at 0 K. See also Pramann and Rademann, 1999; value altered from reference due to conversion from electron convention to ion convention
1.40 ± 0.27R-AIgolkinaThe derived values do not seem reasonable - JEB.; value altered from reference due to conversion from electron convention to ion convention

Gas phase thermochemistry data

Data compiled by: John E. Bartmess

Quantity Value Units Method Reference Comment
Δfgas-1071. ± 23.kJ/molTherBoltalina, Borshchevskii, et al., 1991Data at 0 K. See also Pramann and Rademann, 1999; value altered from reference due to conversion from electron convention to ion convention
Δfgas-1118. ± 15.kJ/molTDEqIgolkinaThe derived values do not seem reasonable - JEB.; value altered from reference due to conversion from electron convention to ion convention

References

Boltalina, Borshchevskii, et al., 1991
Boltalina, O.V.; Borshchevskii, A.Y.; Sidorov, L.N., Thermochemistry of Chromium Gaseous Fluorides and Their Negative Ions, Zh. Fiz. Khim. SSSR, 1991, 65, 884. [all data]

Pramann and Rademann, 1999
Pramann, A.; Rademann, K., Mass-spectrometric study of formation and stability of manganese and manganese oxide cluster anions, Int. J. Mass Spectrom., 1999, 187, 673-683, https://doi.org/10.1016/S1387-3806(98)14197-0 . [all data]

Igolkina
Igolkina, N.A., Negative Ion Molecule Reaction in Chromium Trifluoride Vapor, Dep. Doc. VINITI 7085-83 Pt 1 102. [all data]