CF3CH=C radical anion

Gas phase thermochemistry data

Data compiled by: John E. Bartmess

Quantity Value Units Method Reference Comment
Δfgas-614.21kJ/molEIAEDawson and Jennings, 1976O- + CF3CH=CH2 ->. G3MP2B3 calculations indicate a HOF(A-) = -94 kcal/mol

References

Dawson and Jennings, 1976
Dawson, J.H.J.; Jennings, K.R., Production of gas phase radical anions by reaction of O-. Ions with organic substrates, J. Chem. Soc. Faraday Trans. 2, 1976, 72, 700. [all data]