Naphthalene, 1,3-dinitro- anion

Gas phase thermochemistry data

Data compiled by: John E. Bartmess

Quantity Value Units Method Reference Comment
Δfgas-52. ± 10.kJ/molR-EAHeinis, Chowdhury, et al., 1993ΔGea(423 K)= -39.7 kcal/mol , ΔSea=-3.2 (entropy estimated)

References

Heinis, Chowdhury, et al., 1993
Heinis, T.; Chowdhury, S.; Kebarle, P., Electron Affinities of Naphthalene, Anthracene and Substituted Naphthalenes and Anthracenes, Org. Mass Spectrom., 1993, 28, 4, 358, https://doi.org/10.1002/oms.1210280416 . [all data]