m-Nitroacetophenone anion

Gas phase thermochemistry data

Data compiled by: John E. Bartmess

Quantity Value Units Method Reference Comment
Δfgas-55.2 ± 2.5kcal/molR-EAChowdhury, Kishi, et al., 1989ΔGea(423 K) = -29.3 kcal/mol, ΔS = -2 eu est

References

Chowdhury, Kishi, et al., 1989
Chowdhury, S.; Kishi, H.; Dillow, G.W.; Kebarle, P., Electron Affinities of Substituted Nitrobenzenes, Can. J. Chem., 1989, 67, 4, 603, https://doi.org/10.1139/v89-091 . [all data]