Benzonitrile, 4-(trifluoromethyl)- anion

Gas phase thermochemistry data

Data compiled by: John E. Bartmess

Quantity Value Units Method Reference Comment
Δfgas-525.9 ± 9.2kJ/molR-EAChowdhury and Kebarle, 1986ΔGea(423 K) = -18.6 kcal/mol; ΔSea = +2.6 eu.

References

Chowdhury and Kebarle, 1986
Chowdhury, S.; Kebarle, P., Electron affinities of di- and tetracyanoethylene and cyanobenzenes based on measurements of gas-phase electron transfer equilibria, J. Am. Chem. Soc., 1986, 108, 5453. [all data]