3,5-Bis(trifluoromethyl)nitrobenzene anion

Gas phase thermochemistry data

Data compiled by: John E. Bartmess

Quantity Value Units Method Reference Comment
Δfgas-1448. ± 10.kJ/molR-EAChowdhury, Heinis, et al., 1986ΔGea(423 K) = -40.2 kcal/mol; ΔSea (estimated) = -2.5 eu

Reaction thermochemistry data

Data compiled by: John E. Bartmess

Individual Reactions

C8H3F6NO2- + Silicon tetrafluoride = C8H3F10NO2Si-

By formula: C8H3F6NO2- + F4Si = C8H3F10NO2Si-

Quantity Value Units Method Reference Comment
Δr30.5 ± 2.5kJ/molIMREWilliamson, Knighton, et al., 2001gas phase; at 150 C

References

Chowdhury, Heinis, et al., 1986
Chowdhury, S.; Heinis, T.; Grimsrud, E.P.; Kebarle, P., Entropy Changes and Electron Affinities from Gas-Phase Electron Transfer Equilibria: A- + B = A + B-, J. Phys. Chem., 1986, 90, 12, 2747, https://doi.org/10.1021/j100403a037 . [all data]

Williamson, Knighton, et al., 2001
Williamson, D.H.; Knighton, W.B.; Grimsrud, E.P., Lewis acid-base interactions of SiF4 with molecular anions formed by electron capture reactions, Int. J. Mass Spectrom., 2001, 206, 1-2, 53-61, https://doi.org/10.1016/S1387-3806(00)00388-2 . [all data]