Benzene, 1-bromo-3-nitro- anion

Gas phase thermochemistry data

Data compiled by: John E. Bartmess

Quantity Value Units Method Reference Comment
Δfgas-37. ± 10.kJ/molR-EAChowdhury and Kebarle, 1986ΔGea(423 K) = -29.5 kcal/mol; ΔSea (estimated) = -1.7 eu.

Reaction thermochemistry data

Data compiled by: John E. Bartmess

Individual Reactions

C6H4BrNO2- + Silicon tetrafluoride = C6H4BrF4NO2Si-

By formula: C6H4BrNO2- + F4Si = C6H4BrF4NO2Si-

Quantity Value Units Method Reference Comment
Δr47.3 ± 2.5kJ/molIMREWilliamson, Knighton, et al., 2001gas phase; at 150 C

Ion clustering data

Data compiled by: John E. Bartmess

Clustering reactions

C6H4BrNO2- + Silicon tetrafluoride = C6H4BrF4NO2Si-

By formula: C6H4BrNO2- + F4Si = C6H4BrF4NO2Si-

Quantity Value Units Method Reference Comment
Δr47.3 ± 2.5kJ/molIMREWilliamson, Knighton, et al., 2001gas phase; at 150 C

References

Chowdhury and Kebarle, 1986
Chowdhury, S.; Kebarle, P., Electron affinities of di- and tetracyanoethylene and cyanobenzenes based on measurements of gas-phase electron transfer equilibria, J. Am. Chem. Soc., 1986, 108, 5453. [all data]

Williamson, Knighton, et al., 2001
Williamson, D.H.; Knighton, W.B.; Grimsrud, E.P., Lewis acid-base interactions of SiF4 with molecular anions formed by electron capture reactions, Int. J. Mass Spectrom., 2001, 206, 1-2, 53-61, https://doi.org/10.1016/S1387-3806(00)00388-2 . [all data]