C6F13 anion

Gas phase ion energetics data

Data compiled by: John E. Bartmess

Electron affinity of neutral species

EAneutral (eV) Method Reference Comment
>4.60 ± 0.20EIAESpyrou, Sauers, et al., 1983From n-C6F14

References

Spyrou, Sauers, et al., 1983
Spyrou, S.M.; Sauers, I.; Christophorou, L.G., Electron attachment to the perfluoroalkanes n-CnF2n+2 (n = 1-6) and i-C4F10, J. Chem. Phys., 1983, 78, 7200. [all data]