AsBr radical anion

Gas phase thermochemistry data

Data compiled by: John E. Bartmess

Quantity Value Units Method Reference Comment
Δfgas1.70kcal/molEIAEPabst, Bennett, et al., 1976From AsBr3. G3MP2B3 calculations indicate an EA of ca. 1.3 eV.

References

Pabst, Bennett, et al., 1976
Pabst, R.E.; Bennett, S.L.; Franklin, J.L.; Margrave, J.L., Negative ion electron impact studies of arsenic trihalides: AsF3, AsCl3, and AsBr3, J. Chem. Phys., 1976, 64, 1550. [all data]