KF..Be2F5 anion

Gas phase thermochemistry data

Data compiled by: John E. Bartmess

Quantity Value Units Method Reference Comment
Δfgas-731.3 ± 4.8kcal/molTherNikitin, Sorokin, et al., 1980value altered from reference due to conversion from electron convention to ion convention

References

Nikitin, Sorokin, et al., 1980
Nikitin, M.I.; Sorokin, I.D.; Skokan, E.V.; Sidorov, L.N., Negative Ions in the Saturated Vapors of the Potassium Fluoride - Hafnium Tetrafluoride and Potassium Fluoride - Beryllium Difluoride Systems, Russ. J. Phys. Chem., 1980, 54, page]. [all data]