HCOS anion

Reaction thermochemistry data

Data compiled by: John E. Bartmess

Individual Reactions

CHOS- + Hydrogen cation = CH2OS

By formula: CHOS- + H+ = CH2OS

Quantity Value Units Method Reference Comment
Δr1467. ± 13.kJ/molG+TSKass and DePuy, 1985gas phase; This acidity value, and the HOF(HCOSH), appear to have been estimates, and should not be taken as experimental ones - JEB, 2006,G3MP2B3: 334 kcal/mol
Quantity Value Units Method Reference Comment
Δr1435. ± 13.kJ/molIMRBKass and DePuy, 1985gas phase; This acidity value, and the HOF(HCOSH), appear to have been estimates, and should not be taken as experimental ones - JEB, 2006,G3MP2B3: 334 kcal/mol

Gas phase ion energetics data

Data compiled by: John E. Bartmess

Protonation reactions

CHOS- + Hydrogen cation = CH2OS

By formula: CHOS- + H+ = CH2OS

Quantity Value Units Method Reference Comment
Δr350.7 ± 3.1kcal/molG+TSKass and DePuy, 1985gas phase; This acidity value, and the HOF(HCOSH), appear to have been estimates, and should not be taken as experimental ones - JEB, 2006,G3MP2B3: 334 kcal/mol
Quantity Value Units Method Reference Comment
Δr343.0 ± 3.0kcal/molIMRBKass and DePuy, 1985gas phase; This acidity value, and the HOF(HCOSH), appear to have been estimates, and should not be taken as experimental ones - JEB, 2006,G3MP2B3: 334 kcal/mol

References

Kass and DePuy, 1985
Kass, S.R.; DePuy, C.H., Gas phase ion chemistry of azides. The generation of CH=N- and CH2=NCH2-, J. Org. Chem., 1985, 50, 2874. [all data]