FH..Br anion

Gas phase thermochemistry data

Data compiled by: John E. Bartmess

Quantity Value Units Method Reference Comment
Δfgas-556.5 ± 8.4kJ/molTherLarson and McMahon, 1984Extrapolated from other bihalide data

References

Larson and McMahon, 1984
Larson, J.W.; McMahon, T.B., Gas phase bihalide and pseudohalide ions. An ICR determination of hydrogen bond energies in XHY- species (X,Y = F, Cl, Br, CN), Inorg. Chem., 1984, 23, 2029. [all data]