MeCH=CH anion

Reaction thermochemistry data

Data compiled by: John E. Bartmess

Individual Reactions

C3H5- + Hydrogen cation = Propene

By formula: C3H5- + H+ = C3H6

Quantity Value Units Method Reference Comment
Δr>1693.5 ± 3.8kJ/molG+TSFroelicher, Freiser, et al., 1986gas phase
Quantity Value Units Method Reference Comment
Δr>1661.0kJ/molIMRBFroelicher, Freiser, et al., 1986gas phase

Gas phase ion energetics data

Data compiled by: John E. Bartmess

Electron affinity of neutral species

EAneutral (eV) Method Reference Comment
<0.86 ± 0.18D-EAFroelicher, Freiser, et al., 1986

Protonation reactions

C3H5- + Hydrogen cation = Propene

By formula: C3H5- + H+ = C3H6

Quantity Value Units Method Reference Comment
Δr>404.75 ± 0.90kcal/molG+TSFroelicher, Freiser, et al., 1986gas phase
Quantity Value Units Method Reference Comment
Δr>397.00kcal/molIMRBFroelicher, Freiser, et al., 1986gas phase

References

Froelicher, Freiser, et al., 1986
Froelicher, S.W.; Freiser, B.S.; Squires, R.R., The C3H5- isomers. Experimental and theoretical studies of the tautomeric propenyl ions and the cyclopropyl anion in the gas phase, J. Am. Chem. Soc., 1986, 108, 2853. [all data]