1,3-diazinide anion

Reaction thermochemistry data

Data compiled by: John E. Bartmess

Individual Reactions

C4H3N2- + Hydrogen cation = 1,3-Diazine

By formula: C4H3N2- + H+ = C4H4N2

Quantity Value Units Method Reference Comment
Δr1612. ± 10.kJ/molTDEqMeot-ner and Kafafi, 1988gas phase; Acid: pyrimidine. Anchored to 88MEO scale, not "87 acidity scale
Quantity Value Units Method Reference Comment
Δr1576.5 ± 2.9kJ/molN/AWren, Vogelhuber, et al., 2012gas phase
Δr1577. ± 8.4kJ/molTDEqMeot-ner and Kafafi, 1988gas phase; Acid: pyrimidine. Anchored to 88MEO scale, not "87 acidity scale

Gas phase ion energetics data

Data compiled by: John E. Bartmess

Electron affinity of neutral species

EAneutral (eV) Method Reference Comment
1.8400 ± 0.0060LPESWren, Vogelhuber, et al., 2012
1.14 ± 0.14D-EAMeot-ner and Kafafi, 1988Acid: pyrimidine. Anchored to 88MEO scale, not "87 acidity scale

Protonation reactions

C4H3N2- + Hydrogen cation = 1,3-Diazine

By formula: C4H3N2- + H+ = C4H4N2

Quantity Value Units Method Reference Comment
Δr1612. ± 10.kJ/molTDEqMeot-ner and Kafafi, 1988gas phase; Acid: pyrimidine. Anchored to 88MEO scale, not "87 acidity scale
Quantity Value Units Method Reference Comment
Δr1576.5 ± 2.9kJ/molN/AWren, Vogelhuber, et al., 2012gas phase
Δr1577. ± 8.4kJ/molTDEqMeot-ner and Kafafi, 1988gas phase; Acid: pyrimidine. Anchored to 88MEO scale, not "87 acidity scale

References

Meot-ner and Kafafi, 1988
Meot-ner, M.; Kafafi, S.A., Carbon Acidities of Aromatic Compounds, J. Am. Chem. Soc., 1988, 110, 19, 6297, https://doi.org/10.1021/ja00227a003 . [all data]

Wren, Vogelhuber, et al., 2012
Wren, S.W.; Vogelhuber, K.M.; Garver, J.M.; Kato, S.; Sheps, L.; Bierbaum, V.M.; Lineberger, W.C., C-H Bond Strengths and Acidities in Aromatic Systems: Effects of Nitrogen Incorporation in Mono-, Di-, and Triazines, J. Am. Chem. Soc., 2012, 134, 15, 6584-6595, https://doi.org/10.1021/ja209566q . [all data]