1,6-C2B4H5 anion

Reaction thermochemistry data

Data compiled by: John E. Bartmess

Individual Reactions

C2H5B4- + Hydrogen cation = C2H6B4

By formula: C2H5B4- + H+ = C2H6B4

Quantity Value Units Method Reference Comment
Δr<1891.2kJ/molEIAEOnak, Howard, et al., 1973gas phase; From closo-1,6-C2B4H6. G3MP2B3 calculations indicate a dHacid ca. 378 kcal/mol.

Gas phase ion energetics data

Data compiled by: John E. Bartmess

Protonation reactions

C2H5B4- + Hydrogen cation = C2H6B4

By formula: C2H5B4- + H+ = C2H6B4

Quantity Value Units Method Reference Comment
Δr<452.00kcal/molEIAEOnak, Howard, et al., 1973gas phase; From closo-1,6-C2B4H6. G3MP2B3 calculations indicate a dHacid ca. 378 kcal/mol.

References

Onak, Howard, et al., 1973
Onak, T.; Howard, J.; Brown, C., Negative Ion Mass Spectrometry of closo-Carboranes, J. Chem. Soc. Dalton 76, 1973. [all data]