UOF3..F anion

Gas phase ion energetics data

Data compiled by: John E. Bartmess

Electron affinity of neutral species

EAneutral (eV) Method Reference Comment
3.80 ± 0.43TDEqGorokhov, Pyatenko, et al., 1984

References

Gorokhov, Pyatenko, et al., 1984
Gorokhov, L.N.; Pyatenko, A.T.; Sidorova, I.V.; Smirnov, V.K., Thermochemistry of Molecules and Negative Ions in a Uranium-Oxygen-Fluorine System, Probl. Kalorim. Khim. Termodin. Dokl. Vses. Konf., 1984, 2, 11261c. [all data]