KF..AlF4 anion

Gas phase thermochemistry data

Data compiled by: John E. Bartmess

Quantity Value Units Method Reference Comment
Δfgas-2391. ± 33.kJ/molTherGusarov, Gorokhov, et al., 1979value altered from reference due to conversion from electron convention to ion convention

References

Gusarov, Gorokhov, et al., 1979
Gusarov, A.V.; Gorokhov, L.N.; Pyatenko, A.T.; Sidorova, I.V., Negative ions in the vapors of inorganic compounds, Adv. Mass Spectrom., 1979, 8, 262. [all data]