CsI..I anion

Gas phase ion energetics data

Data compiled by: John E. Bartmess

Electron affinity of neutral species

EAneutral (eV) Method Reference Comment
4.520 ± 0.020LPESWang, Wang, et al., 2010

Gas phase thermochemistry data

Data compiled by: John E. Bartmess

Quantity Value Units Method Reference Comment
Δfgas-116.2 ± 1.3kcal/molTherGusarov, Gorokhov, et al., 1979value altered from reference due to conversion from electron convention to ion convention

References

Wang, Wang, et al., 2010
Wang, Y.L.; Wang, X.B.; Xing, X.P.; Wei, F.; Li, J.; Wang, L.S., Photoelectron Imaging and Spectroscopy of MI2- (M = Cs, Cu, Au): Evolution from Ionic to Covalent Bonding, J. Phys. Chem. A, 2010, 114, 42, 11244-11251, https://doi.org/10.1021/jp103173d . [all data]