Tricarbon anion

Gas phase thermochemistry data

Data compiled by: John E. Bartmess

Quantity Value Units Method Reference Comment
Δfgas650.2 ± 8.4kJ/molR-EAArnold, Bradforth, et al., 1991Linear structure for both neutral and anion

References

Arnold, Bradforth, et al., 1991
Arnold, D.W.; Bradforth, S.E.; Kitsopoulos, T.N.; Neumark, D.M., Vibrationally Resolved Spectra of C2-C11 by Anion Photoelectron Spectroscopy, J. Chem. Phys., 1991, 95, 12, 8753, https://doi.org/10.1063/1.461211 . [all data]