CO2..NO2 anion

Gas phase thermochemistry data

Data compiled by: John E. Bartmess

Quantity Value Units Method Reference Comment
Δfgas-609.0 ± 1.1kJ/molTherHiraoka and Yamabe, 1992

References

Hiraoka and Yamabe, 1992
Hiraoka, K.; Yamabe, S., Formation of the Chelate Bonds in the Cluster O2(-)(CO2)n, CO3(-)(CO2)n, and NO2(-)(CO2)n, J. Chem. Phys., 1992, 97, 1, 643, https://doi.org/10.1063/1.463560 . [all data]