EtOH..PhO anion

Reaction thermochemistry data

Data compiled by: John E. Bartmess

Individual Reactions

phenoxide anion + Ethanol = C8H11O2-

By formula: C6H5O- + C2H6O = C8H11O2-

Quantity Value Units Method Reference Comment
Δr80.8 ± 4.2kJ/molN/AMeot-Ner and Sieck, 1986gas phase
Quantity Value Units Method Reference Comment
Δr46.9 ± 6.7kJ/molTDAsMeot-Ner and Sieck, 1986gas phase

Ion clustering data

Data compiled by: John E. Bartmess

Clustering reactions

phenoxide anion + Ethanol = C8H11O2-

By formula: C6H5O- + C2H6O = C8H11O2-

Quantity Value Units Method Reference Comment
Δr80.8 ± 4.2kJ/molN/AMeot-Ner and Sieck, 1986gas phase
Quantity Value Units Method Reference Comment
Δr46.9 ± 6.7kJ/molTDAsMeot-Ner and Sieck, 1986gas phase

References

Meot-Ner and Sieck, 1986
Meot-Ner, M.; Sieck, L.W., The ionic hydrogen bond and ion solvation. 5. OH...O- bonds. Gas phase solvation and clustering of alkoxide and carboxylate anions, J. Am. Chem. Soc., 1986, 108, 7525. [all data]