iBuBr..Br anion

Gas phase thermochemistry data

Data compiled by: John E. Bartmess

Quantity Value Units Method Reference Comment
Δfgas-382.5kJ/molTherDougherty, 1974

References

Dougherty, 1974
Dougherty, R.C., SN2 reactions in the gas phase. Alkyl group structural effects, Org. Mass Spectrom., 1974, 8, 85. [all data]