MeI..I anion

Reaction thermochemistry data

Data compiled by: John E. Bartmess

Individual Reactions

CH3I2- + 2Methane, iodo- = C2H6I3-

By formula: CH3I2- + 2CH3I = C2H6I3-

Quantity Value Units Method Reference Comment
Δr29.3 ± 0.84kJ/molTDAsHiraoka, Fujita, et al., 1905gas phase
Quantity Value Units Method Reference Comment
Δr4.35 ± 0.84kJ/molTDAsHiraoka, Fujita, et al., 1905gas phase

Gas phase ion energetics data

Data compiled by: John E. Bartmess

Electron affinity of neutral species

EAneutral (eV) Method Reference Comment
3.430 ± 0.010LPESVan Duzor, Wei, et al., 2010

References

Hiraoka, Fujita, et al., 1905
Hiraoka, K.; Fujita, K.; Ishida, M.; Ichikawa, T.; Okada, H.; Hiizumi, K.; Wada, A.; Takao, K.; Yamabe, S.; Tsuchida, N., Gas-phase Ion/Molecule Reactions in C5F8, J. Phys. Chem. A (2005), 1905, 109, 6, 1049-1056., https://doi.org/10.1021/jp040251k . [all data]