UF5 anion

Gas phase thermochemistry data

Data compiled by: John E. Bartmess

Quantity Value Units Method Reference Comment
Δfgas-546. ± 6.kcal/molAVGN/AAverage of 6 values; Individual data points

References

No reference data available.